{"text_format":"2","workbook":"xlsx","n_sheets":8,"sheets":["Instructions","Event Planning Checklist","Event Budget","Budgeted Expenses Worksheet","Gate Sheet","Event Report","Actual Expenses Worksheet","NMS"],"not_rendered":{"charts":0,"images":4,"macros":0,"external_links":0,"defined_names":9,"comments":2,"pivot_tables":0},"unopened":[],"bounds":{"document_bytes":16777216,"sheet_cells":100000,"run_cost":"one","rows_first":2000,"rows_last":500,"rows_between":2000,"halvings":0,"cell_chars":16384,"cell_head_chars":4096},"cells_cut":0,"cells_raw":0,"read":"whole","date_system":"1900"}

{"sheet":"Instructions","index":0,"n_rows":14,"n_cols":2,"rows_kept":14,"cut":false,"hidden":false,"merged":[[0,0,0,1],[1,0,1,1],[3,0,3,1],[4,0,4,1]]}
["SOCIETY FOR CREATIVE ANACHRONISM  INC."]
["EVENT PACKET INSTRUCTIONS"]
[]
["Note that all cells in Green are those to be filled in manually.  Pink cells have drop down menus, white cells will be automatically calculated.  Other formatting may happen depending on cell values."]
[]
["1.   ","On the Event Planning Checklist, enter the Event Name and Event Start Date.  Review the tasks and in the “Needed Task” column,  mark \"YES\" or \"NO\" for each from the drop-down menu.  Dates for each item must be done will be automatically calculated.  If it is not needed, that line item will fade out.  Note that as each item is done, and marked in that column, the formatting for that line item will change."]
["2.   ","On the Event Budget tab, enter the Event End Date, Event Stewards, estimated attendance, and appropriate fees in the green cells.  The total income will be automatically calculated."]
["3.   ","On the Budgeted Expenses worksheet, list all event expenses, quantity, and cost per item in the green cells of the appropriate category.  E.g. Item: porto-potties, Quantity: 2, Price/Item: $100, Total: $200.  Totals for each category align with the Exchequer’s Quarterly Reports, and will fill in on the Budget tab."]
["4.   ","Print the Event Budget tab and the Itemized Expenses Worksheet tab and submit to the Financial Committee for review, commentary, and approval."]
["5.    ","To complete the Event Report, add up total attendance for each fee category in the Income section, and list out any refunds for each fee category in the Refunds section.  In the Expenses section, if there are any variable costs based on attendance, enter that there.  "]
["6.    ","On the Actual Expenses worksheet, complete as on the Budgeted Expenses Worksheet, but with actual costs for all approved expenses.  These will automatically fill in on the Event Report in the Expenses section."]
["7.    ","On the Event Report tab, in the Reconciliation section, enter all funds received in the appropriate section.  Note the check to see if it balances.  In the Transfers section, select “YES” or “NO” if it a Kingdom Event, and note any groups and percentages if there is profit sharing.  The group’s profit will be calculated after all expenses are entered.  "]
["8.    ","Once the Event Report is completed, have it signed by the group’s Seneschal, Exchequer, and Autocrats.  It must be submitted to the Regional Exchequer within 30 days of the end of the event."]
["9.    ","To complete the NMS report, if a check is needed, enter the check number and amount in the green cells.  In the Approvals section, enter the local Exchequer’s contact information.  Print the NMS report, and mail with the check (that is made payable to: “SCA Inc, Middle Kingdom” to the NMS deputy by the due date on the report (14 days after the end of the event)."]

{"sheet":"Event Planning Checklist","index":1,"n_rows":38,"n_cols":6,"rows_kept":38,"cut":false,"hidden":false,"merged":[[0,0,0,5],[1,0,1,5],[30,0,30,1],[18,0,18,1],[26,0,26,1],[27,0,27,1],[28,0,28,1],[29,0,29,1],[24,0,24,1],[19,0,19,1],[20,0,20,1],[21,0,21,1],[22,0,22,1],[23,0,23,1],[13,0,13,1],[14,0,14,1],[3,0,3,1],[5,0,5,1],[6,0,6,1],[15,0,15,1],[16,0,16,1],[11,0,11,1],[25,0,25,1],[12,0,12,1],[32,0,32,1],[7,0,7,1],[8,0,8,1],[9,0,9,1],[10,0,10,1],[17,0,17,1],[31,0,31,1],[33,0,33,1],[34,0,34,1],[35,0,35,1],[36,0,36,1],[37,0,37,1]]}
["SOCIETY FOR CREATIVE ANACHRONISM, INC."]
["KINGDOM OF THE MIDDLE -EXCHEQUER'S EVENT CHECKLIST"]
[null,null,"today's date",{"$f":"TODAY()","v":"2017-08-31"}]
["Item",null,"Needed Task","Due Date","Done?","Notes"]
["Event Name:"]
["Event Bid Approval",null,"YES",{"$f":"IF(C6=\"YES\",$D$5-180,\"\")","v":-180},"NO"]
["Event Budget Approval",null,"YES",{"$f":"IF(C7=\"YES\",$D$5-180,\"\")","v":-180},"NO"]
["Feast Budget Approval",null,"YES",{"$f":"IF(C8=\"YES\",$D$5-90,\"\")","v":-90},"NO"]
["Lunch Budget Approval",null,"YES",{"$f":"IF(C9=\"YES\",$D$5-90,\"\")","v":-90},"NO"]
["Pale Ad Check issued #1",null,"YES",{"$f":"IF(C10=\"YES\",$D$5-70,\"\")","v":-70},"NO"]
["Feast Advance Issued",null,"YES",{"$f":"IF(C11=\"YES\",$D$5-60,\"\")","v":-60},"NO"]
["Lunch Advance Issued",null,"YES",{"$f":"IF(C12=\"YES\",$D$5-60,\"\")","v":-60},"NO"]
["Volunteer Page set up",null,"YES",{"$f":"IF(C13=\"YES\",$D$5-60,\"\")","v":-60},"NO"]
["Pale Ad Check issued #2",null,"YES",{"$f":"IF(C14=\"YES\",$D$5-40,\"\")","v":-40},"NO"]
["Certificate Of Insurance check issued",null,"YES",{"$f":"IF(C15=\"YES\",$D$5-30,\"\")","v":-30},"NO"]
["Equestrian COI check issued",null,"YES",{"$f":"IF(C16=\"YES\",$D$5-30,\"\")","v":-30},"NO"]
["Gate Class offered #2",null,"YES",{"$f":"IF(C17=\"YES\",$D$5-14,\"\")","v":-14},"NO"]
["Gate Class offered #1",null,"YES",{"$f":"IF(C18=\"YES\",$D$5-7,\"\")","v":-7},"NO"]
["Site tokens, feast tokens, maps, event booklet given to Gate Coordinator",null,"YES",-7,"NO"]
["Gate forms prepared and box given to Gate Coordinator",null,"YES",-7,"NO"]
{"$rows_left_out":19}
{"sheet":"Event Budget","index":2,"n_rows":152,"n_cols":9,"rows_kept":152,"cut":false,"hidden":false,"merged":[[54,0,54,8],[29,1,29,8],[30,1,30,8],[31,1,31,8],[47,0,47,1],[33,0,33,2],[52,0,52,1],[39,4,39,7],[40,4,40,7],[34,4,34,6],[56,5,56,7],[57,5,57,7],[58,5,58,7],[59,5,59,7],[60,5,60,7],[60,3,60,4],[59,1,59,2],[56,1,56,2],[57,1,57,2],[0,0,0,8],[1,0,1,8],[55,1,55,2],[55,5,55,7],[3,1,3,8],[6,0,6,1],[4,1,4,4],[28,0,28,8],[22,0,22,8],[17,0,17,8],[7,0,7,8],[21,0,21,7],[26,0,26,7],[16,0,16,7],[35,4,35,6],[33,4,33,6],[20,0,20,1],[19,0,19,1],[13,0,13,1],[12,0,12,1],[11,0,11,1],[10,0,10,1],[8,0,8,1],[9,0,9,1],[150,4,150,8],[151,4,151,8],[51,0,51,1],[48,0,48,1],[53,0,53,1],[58,1,58,2],[145,4,145,8],[146,4,146,8],[147,4,147,8],[148,4,148,8],[149,4,149,8],[140,4,140,8],[141,4,141,8],[142,4,142,8],[143,4,143,8],[144,4,144,8],[135,4,135,8],[136,4,136,8],[137,4,137,8],[138,4,138,8],[139,4,139,8],[130,4,130,8],[131,4,131,8],[132,4,132,8],[133,4,133,8],[134,4,134,8],[125,4,125,8],[126,4,126,8],[127,4,127,8],[128,4,128,8],[129,4,129,8],[120,4,120,8],[121,4,121,8],[122,4,122,8],[123,4,123,8],[124,4,124,8],[115,4,115,8],[116,4,116,8],[117,4,117,8],[118,4,118,8],[119,4,119,8],[110,4,110,8],[111,4,111,8],[112,4,112,8],[113,4,113,8],[114,4,114,8],[105,4,105,8],[106,4,106,8],[107,4,107,8],[108,4,108,8],[109,4,109,8],[100,4,100,8],[101,4,101,8],[102,4,102,8],[103,4,103,8],[104,4,104,8],[95,4,95,8],[96,4,96,8],[97,4,97,8],[98,4,98,8],[99,4,99,8],[90,4,90,8],[91,4,91,8],[92,4,92,8],[93,4,93,8],[94,4,94,8],[85,4,85,8],[86,4,86,8],[87,4,87,8],[88,4,88,8],[89,4,89,8],[80,4,80,8],[81,4,81,8],[82,4,82,8],[83,4,83,8],[84,4,84,8],[75,4,75,8],[76,4,76,8],[77,4,77,8],[78,4,78,8],[79,4,79,8],[70,4,70,8],[71,4,71,8],[72,4,72,8],[73,4,73,8],[74,4,74,8],[65,4,65,8],[66,4,66,8],[67,4,67,8],[68,4,68,8],[69,4,69,8],[43,0,43,1],[42,0,42,1],[44,0,44,1],[23,0,23,1],[45,0,45,1],[24,0,24,1],[25,0,25,1],[50,0,50,1],[49,0,49,1],[60,1,60,2],[59,3,59,4],[58,3,58,4],[57,3,57,4],[55,3,55,4],[36,4,36,6],[37,4,37,6],[38,4,38,6],[46,0,46,1],[56,3,56,4],[14,0,14,1],[15,0,15,1],[18,0,18,1],[39,0,39,1],[40,0,40,1],[41,0,41,1],[32,0,32,1],[34,0,34,1],[35,0,35,1],[36,0,36,1],[37,0,37,1],[38,0,38,1],[27,0,27,7]]}
["SOCIETY FOR CREATIVE ANACHRONISM, INC."]
["KINGDOM OF THE MIDDLE - EVENT BUDGET REPORT"]
[]
["GROUP:","Group Name"]
["EVENT:",{"$f":"IF('Event Planning Checklist'!B5=\"\",\"\",'Event Planning Checklist'!B5)","v":""},null,null,null,"DATE:",{"$f":"IF('Event Planning Checklist'!D5=\"\",\"\",'Event Planning Checklist'!D5)","v":""},"to"]
[]
["INCOME",null,"Age","Pre-Reg Fee","# Reserve","Gate Fee","# at Gate","Total Attendance","Income"]
["Site Fees"]
["Adult - Whole weekend",{"$nulls":6},{"$f":"E9+G9","v":0},{"$f":"(D9*E9) +(F9*G9)","v":0}]
["Adult - One Day",{"$nulls":6},{"$f":"E10+G10","v":0},{"$f":"(D10*E10) +(F10*G10)","v":0}]
["Youth  - Whole Weekend",{"$nulls":6},{"$f":"E11+G11","v":0},{"$f":"(D11*E11) +(F11*G11)","v":0}]
["Youth - One Day ",{"$nulls":6},{"$f":"E12+G12","v":0},{"$f":"(D12*E12) +(F12*G12)","v":0}]
["Child - Whole Weekend",{"$nulls":6},0,0]
["Child - One Day",{"$nulls":6},{"$f":"E14+G14","v":0},{"$f":"(D14*E14) +(F14*G14)","v":0}]
["Family Max - Whole Weekend",{"$nulls":6},0,0]
["Family Max - One Day",{"$nulls":6},{"$f":"E16+G16","v":0},{"$f":"(D16*E16) +(F16*G16)","v":0}]
["Total Site Income",{"$nulls":7},{"$f":"SUM(I9:I15)","v":0}]
["Feast Fees"]
["Adult",{"$nulls":6},0,0]
["Youth",{"$nulls":6},0,0]
{"$rows_left_out":133}
{"sheet":"Budgeted Expenses Worksheet","index":3,"n_rows":93,"n_cols":6,"rows_kept":93,"cut":false,"hidden":false,"merged":[[49,2,49,3],[55,2,55,3],[61,2,61,3],[67,2,67,3],[73,2,73,3],[19,2,19,3],[25,2,25,3],[31,2,31,3],[37,2,37,3],[43,2,43,3],[13,0,13,1],[0,0,0,5],[1,0,1,1],[2,0,6,1],[7,0,7,1],[8,0,12,1],[7,2,7,3],[13,2,13,3],[49,0,49,1],[14,0,18,1],[19,0,19,1],[20,0,24,1],[25,0,25,1],[26,0,30,1],[31,0,31,1],[32,0,36,1],[37,0,37,1],[38,0,42,1],[43,0,43,1],[44,0,48,1],[50,0,54,1],[55,0,55,1],[56,0,60,1],[61,0,61,1],[68,0,72,1],[92,0,92,4],[62,0,66,1],[67,0,67,1],[74,0,78,1],[79,0,79,1],[80,0,91,0],[80,1,85,1],[86,1,91,1],[73,0,73,1],[79,2,79,3],[85,2,85,3],[91,2,91,3]]}
["ITEMIZED EXPENSES:"]
["EXPENSES",null,"Description","Quantity","Price / Item","Budget Total"]
["Non-SCA Advertising",{"$nulls":4},{"$f":"SUM(D3*E3)","v":0}]
[{"$nulls":5},{"$f":"SUM(D4*E4)","v":0}]
[{"$nulls":5},0]
[{"$nulls":5},0]
[{"$nulls":5},0]
[null,null,"Subtotal",null,null,{"$f":"SUM(F3:F7)","v":0}]
["Equipment Rental & Maintenance",{"$nulls":4},{"$f":"SUM(D9*E9)","v":0}]
[{"$nulls":5},0]
[{"$nulls":5},0]
[{"$nulls":5},0]
[{"$nulls":5},0]
[null,null,"Subtotal",null,null,{"$f":"SUM(F9:F13)","v":0}]
["Fees & Honoraria",{"$nulls":4},{"$f":"SUM(D15*E15)","v":0}]
[{"$nulls":5},0]
[{"$nulls":5},0]
[{"$nulls":5},0]
[{"$nulls":5},0]
[null,null,"Subtotal",null,null,{"$f":"SUM(F15:F19)","v":0}]
{"$rows_left_out":74}
{"sheet":"Gate Sheet","index":4,"n_rows":62,"n_cols":35,"rows_kept":62,"cut":false,"hidden":false,"merged":[[0,0,0,7],[0,9,0,30],[9,22,13,22],[9,23,13,23],[9,24,13,24],[9,25,13,25],[9,26,13,26],[9,27,13,27],[9,28,13,28],[9,29,13,29],[9,30,13,30],[2,28,8,28],[7,27,8,27],[2,29,6,29],[2,30,8,30],[7,29,8,29],[2,22,8,22],[7,21,8,21],[2,23,6,23],[2,24,8,24],[7,23,8,23],[2,25,6,25],[2,26,8,26],[7,25,8,25],[59,0,61,0],[59,1,61,1],[59,2,61,2],[59,3,61,3],[59,4,61,4],[55,0,57,0],[9,11,13,11],[9,12,13,12],[9,13,13,13],[59,12,61,12],[43,11,46,11],[43,12,45,12],[43,13,46,13],[57,10,61,10],[49,10,50,10],[47,10,48,10],[47,9,48,9],[49,9,50,9],[57,9,61,9],[18,7,21,7],[34,9,41,10],[51,3,53,3],[30,2,33,2],[30,1,33,1],[14,28,33,28],[14,29,33,29],[14,30,33,30],[9,19,13,19],[9,20,13,20],[9,21,13,21],[55,1,57,1],[55,2,57,2],[55,3,57,3],[55,4,57,4],[9,14,13,14],[9,15,13,15],[9,16,13,16],[9,17,13,17],[9,18,13,18],[43,14,45,14],[14,19,33,19],[14,20,33,20],[14,21,33,21],[14,22,33,22],[14,23,33,23],[14,24,33,24],[14,25,33,25],[14,26,33,26],[14,27,33,27],[34,7,42,7],[14,11,33,11],[14,12,33,12],[14,13,33,13],[14,14,33,14],[14,15,33,15],[14,16,33,16],[14,17,33,17],[14,18,33,18],[35,25,37,25],[35,26,37,26],[35,27,37,27],[2,15,6,15],[2,27,6,27],[2,16,8,16],[7,15,8,15],[2,17,6,17],[2,18,8,18],[7,17,8,17],[2,19,6,19],[2,20,8,20],[7,19,8,19],[2,21,6,21],[38,31,41,32],[47,31,48,32],[49,31,50,32],[57,31,58,32],[53,31,54,32],[55,31,56,32],[44,0,46,0],[44,1,46,1],[44,2,46,2],[44,3,46,3],[44,4,46,4],[39,30,41,30],[39,21,41,21],[39,22,41,22],[39,23,41,23],[39,24,41,24],[43,30,45,30],[43,29,46,29],[43,27,46,27],[43,28,45,28],[43,24,45,24],[43,25,46,25],[43,26,45,26],[34,5,42,5],[39,29,41,29],[39,19,41,19],[39,20,41,20],[1,0,23,0],[2,10,8,10],[10,6,13,6],[14,6,17,6],[18,6,21,6],[10,7,13,7],[10,4,13,4],[10,5,13,5],[6,4,9,4],[6,5,9,5],[6,6,9,6],[6,7,9,7],[9,9,13,10],[14,4,17,4],[14,5,17,5],[14,7,17,7],[14,9,33,9],[14,10,33,10],[18,4,21,4],[18,5,21,5],[7,9,8,9],[5,33,55,34],[47,0,49,0],[47,1,49,1],[47,2,49,2],[47,4,49,4],[47,3,49,3],[55,9,56,9],[55,10,56,10],[51,0,53,0],[51,1,53,1],[51,2,53,2],[51,4,53,4],[24,0,33,0],[1,2,29,2],[39,11,41,11],[39,12,41,12],[39,13,41,13],[39,14,41,14],[39,15,41,15],[39,16,41,16],[39,17,41,17],[39,18,41,18],[39,25,41,25],[39,26,41,26],[51,31,52,32],[47,5,49,5],[51,5,53,5],[55,5,57,5],[59,5,61,5],[44,5,46,5],[47,6,49,6],[51,6,53,6],[55,6,57,6],[59,6,61,6],[51,10,52,10],[60,11,61,11],[53,9,54,9],[53,10,54,10],[59,20,61,20],[59,22,61,22],[59,24,61,24],[59,26,61,26],[59,28,61,28],[59,30,61,30],[44,7,61,7],[42,31,46,32],[34,6,42,6],[35,24,37,24],[56,33,58,33],[56,34,58,34],[60,25,61,25],[60,27,61,27],[60,29,61,29],[60,13,61,13],[60,15,61,15],[60,17,61,17],[60,19,61,19],[60,21,61,21],[60,23,61,23],[59,34,61,34],[59,14,61,14],[59,16,61,16],[59,18,61,18],[39,28,41,28],[2,4,5,4],[2,5,5,5],[2,6,5,6],[2,7,5,7],[26,4,29,4],[26,5,29,5],[26,6,29,6],[26,7,29,7],[30,4,33,4],[30,5,33,5],[30,6,33,6],[30,7,33,7],[22,4,25,4],[22,5,25,5],[22,6,25,6],[22,7,25,7],[2,9,6,9],[2,11,6,11],[2,12,8,12],[7,11,8,11],[2,13,6,13],[2,14,8,14],[7,13,8,13],[43,16,45,16],[43,17,46,17],[43,18,45,18],[43,19,46,19],[43,20,45,20],[43,21,46,21],[43,22,45,22],[43,23,46,23],[39,27,41,27],[1,1,13,1],[14,1,16,1],[17,1,29,1],[4,31,14,32],[42,10,46,10],[42,9,46,9],[34,31,37,32],[35,30,37,30],[35,29,37,29],[35,11,37,11],[35,12,37,12],[35,13,37,13],[35,14,37,14],[35,15,37,15],[35,16,37,16],[35,17,37,17],[35,18,37,18],[35,19,37,19],[35,20,37,20],[35,21,37,21],[35,22,37,22],[35,23,37,23],[35,28,37,28],[43,15,46,15]]}
["Shift:"]
[{"$f":"IF('Event Budget'!B4=\"\",\"\",'Event Budget'!B4)","v":"Group Name"},{"$f":"IF('Event Budget'!I5=\"\",\"\",'Event Budget'!I5)","v":""},{"$f":"IF('Event Budget'!B5=\"\",\"\",'Event Budget'!B5)","v":""}]
[{"$nulls":4},{"$f":"IF('Event Budget'!A26=\"\",\"\",'Event Budget'!A26)","v":"Other Fee"},{"$f":"IF('Event Budget'!F26=\"\",\"\",'Event Budget'!F26)","v":""},null,null,null,"(if under 18) &","Parent/Guardian Name",{"$nulls":20},"Form for use within the Middle Kingdom\nRevised July 2013"]
[]
[{"$nulls":31},"For use within the Middle Kingdom\nRevised June 2014"]
[{"$nulls":33},"SCA Inc, Middle Kingdom Gate Sign-in Sheet"]
[{"$nulls":4},{"$f":"IF('Event Budget'!A25=\"\",\"\",'Event Budget'!A25)","v":"Other Fee"},{"$f":"IF('Event Budget'!F25=\"\",\"\",'Event Budget'!F25)","v":""}]
[{"$nulls":9},"Age"]
[{"$nulls":5},{"$f":"'Event Budget'!F22","v":0}]
[{"$nulls":9},"Branch"]
[{"$nulls":4},{"$f":"IF('Event Budget'!A24=\"\",\"\",'Event Budget'!A24)","v":"Camping"},{"$f":"IF('Event Budget'!F24=\"\",\"\",'Event Budget'!F24)","v":""}]
[]
[{"$nulls":5},{"$f":"'Event Budget'!F26","v":0}]
[]
[null,"-",null,null,"Family Max",{"$f":"IF('Event Budget'!F16=\"\",\"\",'Event Budget'!F16)","v":""},{"$f":"IF('Event Budget'!F15=\"\",\"\",'Event Budget'!F15)","v":""},null,null,"SCA Name","Legal Name","SCA Name","Legal Name","SCA Name","Legal Name","SCA Name","Legal Name","SCA Name","Legal Name","SCA Name","Legal Name","SCA Name","Legal Name","SCA Name","Legal Name","SCA Name","Legal Name","SCA Name","Legal Name","SCA Name","Legal Name"]
[]
[]
[null,{"$f":"IF('Event Budget'!G5=\"\",\"\",'Event Budget'!G5)","v":""}]
[{"$nulls":4},"5 & Under","Free","Free","Free"]
[]
{"$rows_left_out":43}
{"sheet":"Event Report","index":5,"n_rows":86,"n_cols":12,"rows_kept":86,"cut":false,"hidden":false,"merged":[[70,5,70,8],[71,5,71,9],[72,5,72,9],[63,0,63,2],[64,0,64,2],[65,0,65,2],[66,0,66,2],[51,0,51,1],[66,10,66,11],[66,5,66,9],[67,5,67,11],[57,5,57,9],[58,5,58,9],[59,5,59,9],[60,5,60,9],[61,5,61,9],[62,5,62,9],[63,5,63,9],[64,5,64,9],[52,0,52,1],[75,0,75,2],[76,0,76,2],[77,0,77,2],[41,0,41,1],[70,0,70,2],[71,0,71,2],[62,0,62,2],[79,0,79,11],[56,0,56,11],[68,5,68,11],[69,5,69,11],[65,5,65,11],[78,0,78,11],[54,0,54,10],[55,0,55,10],[73,0,73,3],[58,0,58,2],[59,0,59,2],[60,0,60,2],[67,0,67,2],[68,0,68,2],[69,0,69,2],[70,9,70,10],[72,0,72,2],[73,5,73,9],[74,5,74,9],[75,5,75,9],[77,5,77,9],[76,5,76,9],[82,1,82,4],[83,1,83,4],[84,1,84,4],[85,1,85,4],[80,5,80,7],[80,8,80,10],[81,5,81,7],[81,8,81,10],[82,5,82,7],[82,8,82,10],[83,5,83,7],[83,8,83,10],[84,5,84,7],[84,8,84,10],[85,5,85,7],[85,8,85,10],[80,1,80,4],[81,1,81,4],[74,0,74,2],[8,0,8,11],[18,0,18,11],[23,0,23,11],[33,0,33,11],[43,0,43,11],[36,0,36,1],[37,0,37,1],[38,0,38,1],[39,0,39,1],[40,0,40,1],[15,0,15,1],[19,0,19,1],[20,0,20,1],[21,0,21,1],[22,0,22,3],[26,0,26,1],[24,0,24,1],[25,0,25,1],[17,0,17,3],[9,0,9,1],[10,0,10,1],[29,0,29,10],[30,0,30,5],[30,7,30,8],[16,0,16,1],[11,0,11,1],[12,0,12,1],[13,0,13,1],[14,0,14,1],[27,0,27,1],[32,0,32,1],[34,0,34,1],[35,0,35,1],[31,0,31,11],[49,0,49,1],[50,0,50,1],[61,0,61,2],[28,0,28,3],[53,0,53,3],[48,0,48,11],[46,0,46,1],[44,0,44,1],[45,0,45,1],[47,0,47,3],[42,0,42,3],[57,0,57,3],[4,1,4,4],[7,0,7,1],[3,1,3,11],[0,0,0,11],[1,0,1,11],[4,6,4,7],[4,9,4,10],[5,8,5,9],[5,0,5,5],[5,6,5,7]]}
["SOCIETY FOR CREATIVE ANACHRONISM, INC."]
["KINGDOM OF THE MIDDLE - FINAL EVENT REPORT"]
[]
["GROUP:",{"$f":"IF('Event Budget'!B4=\"\",\"\",'Event Budget'!B4)","v":"Group Name"}]
["EVENT:",{"$f":"IF('Event Budget'!B5=\"\",\"\",'Event Budget'!B5)","v":""},null,null,null,"DATE:",{"$f":"IF('Event Budget'!G5=\"\",\"\",'Event Budget'!G5)","v":""},null,"to",{"$f":"IF('Event Budget'!I5=\"\",\"\",'Event Budget'!I5)","v":""}]
["Due 30 days after the close of the event",{"$nulls":5},"Due Date:",null,{"$f":"IF('Event Budget'!I5=\"\",\"\",'Event Budget'!I5+30)","v":""}]
[]
["INCOME",null,"Age","Pre-Reg \nFee","# \nACCEPS","# \nMail-In","Pre-reg\nTotals","Gate\nFee","# at \nGate","Gate \nTotals","Total \nAttendance","Total \nIncome"]
["Site Fees"]
[{"$f":"'Event Budget'!A9","v":"Adult - Whole weekend"},null,{"$f":"'Event Budget'!C9","v":0},{"$f":"'Event Budget'!D9","v":0},null,null,{"$f":"SUM(E10+F10)*D10","v":0},{"$f":"'Event Budget'!F9","v":0},null,{"$f":"SUM(H10*I10)","v":0},{"$f":"E10+F10+I10","v":0},{"$f":"SUM(G10+J10)","v":0}]
[{"$f":"'Event Budget'!A10","v":"Adult - One Day"},null,{"$f":"'Event Budget'!C10","v":0},{"$f":"'Event Budget'!D10","v":0},null,null,0,{"$f":"'Event Budget'!F10","v":0},null,{"$f":"SUM(H11*I11)","v":0},{"$f":"E11+F11+I11","v":0},0]
[{"$f":"'Event Budget'!A11","v":"Youth  - Whole Weekend"},null,{"$f":"'Event Budget'!C11","v":0},{"$f":"'Event Budget'!D11","v":0},null,null,0,{"$f":"'Event Budget'!F11","v":0},null,0,0,0]
[{"$f":"'Event Budget'!A12","v":"Youth - One Day "},null,{"$f":"'Event Budget'!C12","v":0},{"$f":"'Event Budget'!D12","v":0},null,null,0,{"$f":"'Event Budget'!F12","v":0},null,0,0,0]
[{"$f":"'Event Budget'!A13","v":"Child - Whole Weekend"},null,{"$f":"'Event Budget'!C13","v":0},{"$f":"'Event Budget'!D13","v":0},null,null,0,{"$f":"'Event Budget'!F13","v":0},null,0,0,0]
[{"$f":"'Event Budget'!A14","v":"Child - One Day"},null,{"$f":"'Event Budget'!C14","v":0},{"$f":"'Event Budget'!D14","v":0},null,null,0,{"$f":"'Event Budget'!F14","v":0},null,0,0,0]
[{"$f":"'Event Budget'!A15","v":"Family Max - Whole Weekend"},null,{"$f":"'Event Budget'!C15","v":0},{"$f":"'Event Budget'!D15","v":0},null,null,0,{"$f":"'Event Budget'!F15","v":0},null,0,0,0]
[{"$f":"'Event Budget'!A16","v":"Family Max - One Day"},null,{"$f":"'Event Budget'!C16","v":0},{"$f":"'Event Budget'!D16","v":0},null,null,{"$f":"SUM(E17+F17)*D17","v":0},{"$f":"'Event Budget'!F16","v":0},null,{"$f":"SUM(H17*I17)","v":0},{"$f":"E17+F17+I17","v":0},{"$f":"SUM(G17+J17)","v":0}]
["Total Site Income",null,null,null,{"$f":"SUM(E10:E17)","v":0},{"$f":"SUM(F10:F17)","v":0},0,null,0,0,0,0]
["Feast Fees"]
[{"$f":"'Event Budget'!A19","v":"Adult"},null,{"$f":"'Event Budget'!C19","v":0},{"$f":"'Event Budget'!D19","v":0},null,null,{"$f":"SUM(E20+F20)*D20","v":0},{"$f":"'Event Budget'!F19","v":0},null,{"$f":"SUM(H20*I20)","v":0},{"$f":"E20+F20+I20","v":0},{"$f":"SUM(G20+J20)","v":0}]
{"$rows_left_out":67}
{"sheet":"Actual Expenses Worksheet","index":6,"n_rows":93,"n_cols":6,"rows_kept":93,"cut":false,"hidden":false,"merged":[[92,0,92,4],[73,0,73,1],[73,2,73,3],[74,0,78,1],[79,0,79,1],[79,2,79,3],[80,0,91,0],[80,1,85,1],[85,2,85,3],[86,1,91,1],[91,2,91,3],[68,0,72,1],[49,0,49,1],[49,2,49,3],[50,0,54,1],[55,0,55,1],[55,2,55,3],[56,0,60,1],[61,0,61,1],[61,2,61,3],[62,0,66,1],[67,0,67,1],[67,2,67,3],[44,0,48,1],[25,0,25,1],[25,2,25,3],[26,0,30,1],[31,0,31,1],[31,2,31,3],[32,0,36,1],[37,0,37,1],[37,2,37,3],[38,0,42,1],[43,0,43,1],[43,2,43,3],[20,0,24,1],[0,0,0,5],[1,0,1,1],[2,0,6,1],[7,0,7,1],[7,2,7,3],[8,0,12,1],[13,0,13,1],[13,2,13,3],[14,0,18,1],[19,0,19,1],[19,2,19,3]]}
["ITEMIZED EXPENSES:"]
["EXPENSES",null,"Description","Quantity","Price / Item","Budget Total"]
["Non-SCA Advertising",{"$nulls":4},{"$f":"SUM(D3*E3)","v":0}]
[{"$nulls":5},{"$f":"SUM(D4*E4)","v":0}]
[{"$nulls":5},0]
[{"$nulls":5},0]
[{"$nulls":5},0]
[null,null,"Subtotal",null,null,{"$f":"SUM(F3:F7)","v":0}]
["Equipment Rental & Maintenance",{"$nulls":4},{"$f":"SUM(D9*E9)","v":0}]
[{"$nulls":5},0]
[{"$nulls":5},0]
[{"$nulls":5},0]
[{"$nulls":5},0]
[null,null,"Subtotal",null,null,{"$f":"SUM(F9:F13)","v":0}]
["Fees & Honoraria",{"$nulls":4},{"$f":"SUM(D15*E15)","v":0}]
[{"$nulls":5},0]
[{"$nulls":5},0]
[{"$nulls":5},0]
[{"$nulls":5},0]
[null,null,"Subtotal",null,null,{"$f":"SUM(F15:F19)","v":0}]
{"$rows_left_out":74}
{"sheet":"NMS","index":7,"n_rows":30,"n_cols":7,"rows_kept":30,"cut":false,"hidden":false,"merged":[[0,0,0,7],[10,1,10,4],[5,1,5,7],[4,4,4,6],[17,1,17,7],[7,1,7,7],[29,1,29,3],[29,5,29,7],[20,2,20,7],[26,1,26,7],[1,0,1,7],[27,1,27,7],[28,1,28,3],[13,0,13,4],[20,0,20,1],[21,0,21,1],[22,0,22,1],[21,2,21,7],[22,2,22,7],[11,1,11,4],[2,0,2,2],[2,4,2,5]]}
["SOCIETY FOR CREATIVE ANACHRONISM, INC."]
["KINGDOM OF THE MIDDLE - NON-MEMBER SURCHARGE REPORT"]
["Due 14 days after the close of the event",null,null,"Due Date:",{"$f":"IF('Event Budget'!I5=\"\",\"\",'Event Budget'!I5+14)","v":""}]
[]
["EVENT DATE:",{"$f":"IF('Event Budget'!G5=\"\",\"\",'Event Budget'!G5)","v":""},null,"END DATE:",{"$f":"IF('Event Budget'!I5=\"\",\"\",'Event Budget'!I5)","v":""}]
["GROUP:",{"$f":"IF('Event Budget'!B4=\"\",\"\",'Event Budget'!B4)","v":"Group Name"}]
[]
["EVENT:",{"$f":"IF('Event Budget'!B5=\"\",\"\",'Event Budget'!B5)","v":""}]
[]
[]
[null,"Total # actual adult attendees",null,null,null,{"$f":"SUM('Event Report'!K10,'Event Report'!K11,-'Event Report'!K35,-'Event Report'!K36)","v":0}]
[null,"# Non-members attending",null,null,null,{"$f":"SUM('Event Report'!K28,-'Event Report'!K53)","v":0}]
[]
["Make check payable to:  SCA Inc, Middle Kingdom",{"$nulls":4},{"$f":"SUM('Event Report'!L28,-'Event Report'!L53)","v":0}]
[]
["Check Number",null,"Check Date"]
[]
["Mail to:","Domnall Ohodhrain (Dennis Horan) PO Box 455 Greensburg, IN  47240"]
[]
[]
{"$rows_left_out":10}